Home > Gcc Error > Gcc Error 53

Gcc Error 53

When you see the option to Restore or Update, click Restore. Installing the jessie 4.8.3-13 package requires a load of dependent packages and trying to install them is bringing up a variety of other issues such as, additional dependencies, installed packages it When you see the option in iTunes to Restore or Update, click Update. Pass -v to gcc to get the exact ld command it is running.

The GNU linker doesn't do that, though. How to use the binomial theorem to calculate binomials with a negative exponent What actually are virtual particles? share|improve this answer answered Dec 13 '12 at 13:53 chill 12k11834 That entry is there, although it's #define SIZEOF_LONG 4 here. Privacy Policy Terms of Use Sales and Refunds Site Map Contact Apple United States (English) Skip to content Morten Welinder No Shiny Glass Beads, Please Menu and widgets Categories General Gnome read this article

Modulo % with big number- Infinity error - Javascript What (combination of) licenses is popular for public/shared proprietary software (“Feel free to contribute, but only we can make commercial use”)? Posted on 2014-01-27Author mortenwCategories General Post navigation Previous Previous post: Spreadsheets and the Command LineNext Next post: Writing Tests is Humbling Proudly powered by WordPress How can I make LaTeX break the word at the end of line more beautiful? It looks like clang is suppressing the second and further errors on a line.

I know those are CPU architecture, but do you want me to do something? Personal Open source Business Explore Sign up Sign in Pricing Blog Support Search GitHub This repository Watch 548 Star 3,211 Fork 1,779 raspberrypi/linux Code Issues 193 Pull requests 23 Projects This means my PATH to the raspberry tools was just set wrong. Why was the identity of the Half-Blood Prince important to the story?

how can you tell if the engine is not brand new? C++ doesn't fare any better:
#include
std::vector foo; // should have been map
gcc delivers 67 lines of nonsense starting with
/usr/include/c++/4.8/ext/alloc_traits.h:199:53: error: ‘int’ Additional Product Support Information Start a Discussion in Apple Support Communities Ask other users about this article Wait... my company Relation between representations of p-adic groups and affine Hecke algebras What are oxidation states used for?

When you see the screen for Touch ID, tap Set up Touch ID later. asked 3 years ago viewed 2884 times active 3 years ago Linked 7 Error compiling gcc 4.6.2 under ubuntu 11.10 0 Why does `configure` not fail while `config.log` contains errors? Radius of Convergence of Infinite Series Are the words "expression" and "term" interchangeable in programming language theory? It was a bad path setting.

popcornmix closed this Jan 9, 2016 Sign up for free to join this conversation on GitHub. http://stackoverflow.com/questions/13857250/gcc-compilation-yields-real-h53-error-sizeof-long-undeclared-here-not-in Though the output is still not very readable. popcornmix commented Jan 9, 2016 @MrEngman I assume this is no longer an issue with jessie and can be close? I looked all over google and the only error codes I managed to find was 1 and 12.

gcc-4.8 came in from the Collabora work on Webkit and the new browser. You signed in with another tab or window. Do you see any other error message from the linker? Already have an account?

When you see your iOS device's Hello screen, follow the onscreen steps to set up your device. CC kernel/bounds.s GEN include/generated/bounds.h CC arch/arm/kernel/asm-offsets.s arch/arm/kernel/asm-offsets.c:53:2: error: #error Your compiler is too buggy; it is known to miscompile kernels #error Your compiler is too buggy; it is known to miscompile Any suggestions for installing gcc 4.8.3-13 and related packages on my Pi? Is there a Korean word for 'Syllable Block'?

I am getting a link error: "collect2: ld returned 53 exit status" What does this error code mean? Unfortunately, make throws quite some errors, starting with gcc -c -DIN_GCC_FRONTEND -g -fkeep-inline-functions -DIN_GCC -W -Wall -Wwrite-strings -Wcast-qual -Wstrict-prototypes -Wmissing-prototypes -Wmissing-formIn file included from ../../gcc-4.7.2/gcc/tree.h:32, from ../../gcc-4.7.2/gcc/c-lang.c:27: ../../gcc-4.7.2/gcc/real.h:53: error: 'SIZEOF_LONG' undeclared Fell free to close if you want to.

If you run gcc with -Wl,-debug, you will see exactly how collect2 runs ld.

Do I have to define these manually with some configure parameter or how can this issue be resolved? Moving on with a missing opening parenthesis:
static int foo (int a, int b) { return a + b; }
int bar (int a) { return foo a); On a Unix host this would mean that the linker returned an exit status of 53--that is, it called "exit (53);". I created a sample project to show my issue.

Personal Open source Business Explore Sign up Sign in Pricing Blog Support Search GitHub This repository Watch 60 Star 198 Fork 17 android-ndk/ndk Code Issues 62 Pull requests 0 Projects Unproven vs. https://github.com/4brunu/AndroidNDK_GCC_To_Clang/blob/master/AndroidNDK_GCC_To_Clang/app/build.gradle#L53-L55 With gcc work's, but not with clang. My bad that i didnt check that first.

Browse other questions tagged gcc or ask your own question. Terms Privacy Security Status Help You can't perform that action at this time. How should I interpret "English is poor" review when I used a language check service before submission? contains current directory error mentioned in that post, but didn't think about checking other variables for that as well) Compilation is still running, so far no more errors...

Index Nav: [DateIndex] [SubjectIndex] [AuthorIndex] [ThreadIndex] Message Nav: [DatePrev][DateNext] [ThreadPrev][ThreadNext] Other format: [Raw text] Re: Link error 53 From: Ian Lance Taylor To: San Saeteurn

Unsubstantiated permissions on /etc/shadow Can Communism become a stable economic strategy? I've read that you need 4.8.3 or higher, but isnt 4.8.4 good enough? Nothing on 53. > Is there a place I can go to to view a listing of all the error codes > and their meaning? Cross compiling is not possible for me but I am not interested in fully compiling the kernel but just setting it up for compiling particular wifi modules as per my original

Sign in to comment Contact GitHub API Training Shop Blog About © 2016 GitHub, Inc. Check this lines to change between clang and gcc. I thought I would deliver my few cents too. The actual solution did involve some more trouble though - if it's the solution, the compilation is still running... –Tobias Kienzler Dec 14 '12 at 8:05 add a comment| up vote

date: invalid date '2016-10-16' Why was the identity of the Half-Blood Prince important to the story? It should be 4.8.3-13 which is okay (https://packages.debian.org/jessie/gcc-4.8) asb commented Jan 6, 2015 It's not an upstream Raspbian issue - it's an issue with the version we (Raspberry Pi) are distributing. This is the mail archive of the [email protected] mailing list for the GCC project. Note, however, that in this case it has suppressed the more informative error.

Thanks android-ndk member DanAlbert commented May 23, 2016 Probably need a -latomic.